{"text_format":"1","workbook":"xlsx","n_sheets":8,"sheets":["Menu","State1&State2","State3","State4","Max. ARC Revenue Calc","CAF Calc","Footnotes","End"],"not_rendered":{"charts":0,"images":0,"macros":1,"external_links":0,"defined_names":30,"comments":0,"pivot_tables":0},"unopened":[],"bounds":{"document_bytes":16777216,"sheet_cells":100000,"rows_first":2000,"rows_last":500,"rows_between":2000,"halvings":0,"cell_chars":16384,"cell_head_chars":4096},"cells_cut":0,"cells_raw":0,"read":"whole","date_system":"1900"}

{"sheet":"Menu","index":0,"n_rows":7,"n_cols":6,"rows_kept":7,"cut":false,"hidden":false,"merged":[[9,5,10,5],[33,5,34,5],[17,5,18,5]]}
[]
[]
[]
[]
[null,null,null,null,null,"KEY (Erase text & color before filing):"]
[null,null,null,null,null,"Label / Date Change"]
[null,null,null,null,null,"Formula changes / mandated by FCC rules"]

{"sheet":"State1&State2","index":1,"n_rows":27,"n_cols":30,"rows_kept":27,"cut":false,"hidden":false,"merged":[[5,4,5,14],[5,24,6,25],[5,26,6,27],[5,28,6,29],[6,4,6,13],[6,20,6,21]]}
[null,3257,"Filing Date:","2022-06-16",null,null,null,null,null,null,null,null,null,null,null,null,"ARC-CAF-1"]
[null,null,"Holding Company:"]
[null,null,"Filing Name:"]
[]
[]
[null,null,null,null,"Rate Ceiling Component Charges Calculation ( 51.915(b)(11) )",null,null,null,null,null,null,null,null,null,null,null,null,null,null,null,null,null,null,null,"RESIDENCE / NP  (excluding Lifeline)",null,"SLB / BRI",null,"MULTI-LINE BUSINESS"]
[null,null,"Study Area","EXCHANGES","RESIDENCE / NP / BRI / SLB (excluding Lifeline)",null,null,null,null,null,null,null,null,null,"Total Crnt Yr","Max Total","Maximum",null,null,null,"MULTI-LINE BUSINESS"]
[null,null,null,null,"Res / NP","SLB / BRI",null,null,"Mandatory",null,null,null,null,null,"Rate Ceiling","Rate Ceiling","Rate Ceiling","Res / NP","SLB / BRI",null,null,null,null,null,"MAX Curr Yr",null,"MAX Curr Yr",null,"MAX Curr Yr"]
[null,null,null,null,"Tariff Period  ","Tariff Period  ","Stand-alone","Mandatory","Zone","State",null,null,"State ","Federal","Comp. Chgs","Comp. Chgs","Comp. Chgs","Prv Yrs","Prv Yrs",null,"Tariff Period  ","Federal","Prv Yrs",null,"Res / NP","MAX Curr Yr","SLB / BRI","MAX Curr Yr","MLB","MAX Curr Yr"]
[null,null,null,null,"Projected Lines","Projected Lines","R1 rate","EAS","Charges","SLC","E911","TRS","USF","SLC","w/o ARC","Since 2012","to date","Max Rate","Max Rate",null,"Projected Lines","SLC-MLB","Max Rate",null,"ARC Rate","ARC Rev","ARC Rate","ARC Rev","ARC Rate","ARC Rev"]
[]
[null,null,null,"State1"]
[{"$f":"B13&\": \"&D13","v":"S1: Example 1"},"S1","S1StudyArea","Example 1",0,0,0,0,0,0,0,0,0,0,{"$f":"ROUND(SUM(G13:N13),2)","v":0},0,{"$f":"MAX(O13,P13)","v":0},0,0,null,0,0,0,null,{"$f":"IF(('Max. ARC Revenue Calc'!$B$13-$Q13)<0,0,MIN(('Max. ARC Revenue Calc'!$B$13-$Q13),R13+'Max. ARC Revenue Calc'!$B$17,'Max. ARC Revenue Calc'!$B$15))","v":0.5},{"$f":"E13*Y13","v":0},{"$f":"MIN(S13+'Max. ARC Revenue Calc'!$B$17,'Max. ARC Revenue Calc'!$B$15)","v":0.5},{"$f":"F13*AA13","v":0},{"$f":"IF(('Max. ARC Revenue Calc'!$B$14 - V13)<0,0,MIN(('Max. ARC Revenue Calc'!$B$14 - V13),W13 + 'Max. ARC Revenue Calc'!$B$18, 'Max. ARC Revenue Calc'!$B$16))","v":1},{"$f":"U13*AC13","v":0}]
["S1: Example 2","S1","S1StudyArea","Example 2",0,0,0,0,0,0,0,0,0,0,0,0,0,0,0,null,0,0,0,null,{"$f":"IF(('Max. ARC Revenue Calc'!$B$13-$Q14)<0,0,MIN(('Max. ARC Revenue Calc'!$B$13-$Q14),R14+'Max. ARC Revenue Calc'!$B$17,'Max. ARC Revenue Calc'!$B$15))","v":0.5},0,{"$f":"MIN(S14+'Max. ARC Revenue Calc'!$B$17,'Max. ARC Revenue Calc'!$B$15)","v":0.5},0,{"$f":"IF(('Max. ARC Revenue Calc'!$B$14 - V14)<0,0,MIN(('Max. ARC Revenue Calc'!$B$14 - V14),W14 + 'Max. ARC Revenue Calc'!$B$18, 'Max. ARC Revenue Calc'!$B$16))","v":1},0]
["S1: Example 3","S1","S1StudyArea","Example 3",0,0,0,0,0,0,0,0,0,0,0,0,0,0,0,null,0,0,0,null,{"$f":"IF(('Max. ARC Revenue Calc'!$B$13-$Q15)<0,0,MIN(('Max. ARC Revenue Calc'!$B$13-$Q15),R15+'Max. ARC Revenue Calc'!$B$17,'Max. ARC Revenue Calc'!$B$15))","v":0.5},0,{"$f":"MIN(S15+'Max. ARC Revenue Calc'!$B$17,'Max. ARC Revenue Calc'!$B$15)","v":0.5},0,{"$f":"IF(('Max. ARC Revenue Calc'!$B$14 - V15)<0,0,MIN(('Max. ARC Revenue Calc'!$B$14 - V15),W15 + 'Max. ARC Revenue Calc'!$B$18, 'Max. ARC Revenue Calc'!$B$16))","v":1},0]
["S1: Example 4","S1","S1StudyArea","Example 4",0,0,0,0,0,0,0,0,0,0,0,0,0,0,0,null,0,0,0,null,{"$f":"IF(('Max. ARC Revenue Calc'!$B$13-$Q16)<0,0,MIN(('Max. ARC Revenue Calc'!$B$13-$Q16),R16+'Max. ARC Revenue Calc'!$B$17,'Max. ARC Revenue Calc'!$B$15))","v":0.5},0,{"$f":"MIN(S16+'Max. ARC Revenue Calc'!$B$17,'Max. ARC Revenue Calc'!$B$15)","v":0.5},0,{"$f":"IF(('Max. ARC Revenue Calc'!$B$14 - V16)<0,0,MIN(('Max. ARC Revenue Calc'!$B$14 - V16),W16 + 'Max. ARC Revenue Calc'!$B$18, 'Max. ARC Revenue Calc'!$B$16))","v":1},0]
["S1: Example 5","S1","S1StudyArea","Example 5",0,0,0,0,0,0,0,0,0,0,0,0,0,0,0,null,0,0,0,null,{"$f":"IF(('Max. ARC Revenue Calc'!$B$13-$Q17)<0,0,MIN(('Max. ARC Revenue Calc'!$B$13-$Q17),R17+'Max. ARC Revenue Calc'!$B$17,'Max. ARC Revenue Calc'!$B$15))","v":0.5},0,{"$f":"MIN(S17+'Max. ARC Revenue Calc'!$B$17,'Max. ARC Revenue Calc'!$B$15)","v":0.5},0,{"$f":"IF(('Max. ARC Revenue Calc'!$B$14 - V17)<0,0,MIN(('Max. ARC Revenue Calc'!$B$14 - V17),W17 + 'Max. ARC Revenue Calc'!$B$18, 'Max. ARC Revenue Calc'!$B$16))","v":1},0]
["S1: Example 6","S1","S1StudyArea","Example 6",0,0,0,0,0,0,0,0,0,0,0,0,0,0,0,null,0,0,0,null,{"$f":"IF(('Max. ARC Revenue Calc'!$B$13-$Q18)<0,0,MIN(('Max. ARC Revenue Calc'!$B$13-$Q18),R18+'Max. ARC Revenue Calc'!$B$17,'Max. ARC Revenue Calc'!$B$15))","v":0.5},0,{"$f":"MIN(S18+'Max. ARC Revenue Calc'!$B$17,'Max. ARC Revenue Calc'!$B$15)","v":0.5},0,{"$f":"IF(('Max. ARC Revenue Calc'!$B$14 - V18)<0,0,MIN(('Max. ARC Revenue Calc'!$B$14 - V18),W18 + 'Max. ARC Revenue Calc'!$B$18, 'Max. ARC Revenue Calc'!$B$16))","v":1},0]
["S1: Example 7","S1","S1StudyArea","Example 7",0,0,0,0,0,0,0,0,0,0,0,0,0,0,0,null,0,0,0,null,{"$f":"IF(('Max. ARC Revenue Calc'!$B$13-$Q19)<0,0,MIN(('Max. ARC Revenue Calc'!$B$13-$Q19),R19+'Max. ARC Revenue Calc'!$B$17,'Max. ARC Revenue Calc'!$B$15))","v":0.5},0,{"$f":"MIN(S19+'Max. ARC Revenue Calc'!$B$17,'Max. ARC Revenue Calc'!$B$15)","v":0.5},0,{"$f":"IF(('Max. ARC Revenue Calc'!$B$14 - V19)<0,0,MIN(('Max. ARC Revenue Calc'!$B$14 - V19),W19 + 'Max. ARC Revenue Calc'!$B$18, 'Max. ARC Revenue Calc'!$B$16))","v":1},0]
["S1: Example 8","S1","S1StudyArea","Example 8",0,0,0,0,0,0,0,0,0,0,0,0,0,0,0,null,0,0,0,null,{"$f":"IF(('Max. ARC Revenue Calc'!$B$13-$Q20)<0,0,MIN(('Max. ARC Revenue Calc'!$B$13-$Q20),R20+'Max. ARC Revenue Calc'!$B$17,'Max. ARC Revenue Calc'!$B$15))","v":0.5},0,{"$f":"MIN(S20+'Max. ARC Revenue Calc'!$B$17,'Max. ARC Revenue Calc'!$B$15)","v":0.5},0,{"$f":"IF(('Max. ARC Revenue Calc'!$B$14 - V20)<0,0,MIN(('Max. ARC Revenue Calc'!$B$14 - V20),W20 + 'Max. ARC Revenue Calc'!$B$18, 'Max. ARC Revenue Calc'!$B$16))","v":1},0]
{"$rows_left_out":8}
{"sheet":"State3","index":2,"n_rows":251,"n_cols":30,"rows_kept":251,"cut":false,"hidden":false,"merged":[[5,4,5,14],[5,24,6,25],[5,26,6,27],[5,28,6,29],[6,4,6,13],[6,20,6,21]]}
[null,3257,"Filing Date:","2022-06-16",null,null,null,null,null,null,null,null,null,null,null,null,"ARC-CAF-1"]
[null,null,"Holding Company:"]
[null,null,"Filing Name:"]
[]
[]
[null,null,null,null,"Rate Ceiling Component Charges Calculation ( 51.915(b)(11) )",null,null,null,null,null,null,null,null,null,null,null,null,null,null,null,null,null,null,null,"RESIDENCE / NP  (excluding Lifeline)",null,"SLB / BRI",null,"MULTI-LINE BUSINESS"]
[null,null,"Study Area","EXCHANGES","RESIDENCE / NP / BRI / SLB (excluding Lifeline)",null,null,null,null,null,null,null,null,null,"Total Crnt Yr","Max Total","Maximum",null,null,null,"MULTI-LINE BUSINESS"]
[null,null,null,null,"Res / NP","SLB / BRI",null,null,"Mandatory",null,null,null,null,null,"Rate Ceiling","Rate Ceiling","Rate Ceiling","Res / NP","SLB / BRI",null,null,null,null,null,"MAX Curr Yr",null,"MAX Curr Yr",null,"MAX Curr Yr"]
[null,null,null,null,"Tariff Period  ","Tariff Period  ","Stand-alone","Mandatory","Zone","State",null,null,"State ","Federal","Comp. Chgs","Comp. Chgs","Comp. Chgs","Prv Yrs","Prv Yrs",null,"Tariff Period  ","Federal","Prv Yrs",null,"Res / NP","MAX Curr Yr","SLB / BRI","MAX Curr Yr","MLB","MAX Curr Yr"]
[null,null,null,null,"Projected Lines","Projected Lines","R1 rate","EAS","Charges","SLC","E911","TRS","USF","SLC","w/o ARC","Since 2012","to date","Max Rate","Max Rate",null,"Projected Lines","SLC-MLB","Max Rate",null,"ARC Rate","ARC Rev","ARC Rate","ARC Rev","ARC Rate","ARC Rev"]
[]
[null,null,null,"State3"]
[null,null,null,"Label 1"]
[{"$f":"B14&\": \"&D14","v":"S3: Example 1"},"S3","S3StudyArea","Example 1",0,0,0,0,0,0,0,0,0,0,{"$f":"ROUND(SUM(G14:N14),2)","v":0},0,{"$f":"MAX(O14,P14)","v":0},0,0,null,0,0,0,null,{"$f":"IF(('Max. ARC Revenue Calc'!$B$13-$Q14)<0,0,MIN(('Max. ARC Revenue Calc'!$B$13-$Q14),R14+'Max. ARC Revenue Calc'!$B$17,'Max. ARC Revenue Calc'!$B$15))","v":0.5},{"$f":"E14*Y14","v":0},{"$f":"MIN(S14+'Max. ARC Revenue Calc'!$B$17,'Max. ARC Revenue Calc'!$B$15)","v":0.5},{"$f":"F14*AA14","v":0},{"$f":"IF(('Max. ARC Revenue Calc'!$B$14 - V14)<0,0,MIN(('Max. ARC Revenue Calc'!$B$14 - V14),W14 + 'Max. ARC Revenue Calc'!$B$18, 'Max. ARC Revenue Calc'!$B$16))","v":1},{"$f":"U14*AC14","v":0}]
["S3: Example 2","S3","S3StudyArea","Example 2",0,0,0,0,0,0,0,0,0,0,0,0,0,0,0,null,0,0,0,null,{"$f":"IF(('Max. ARC Revenue Calc'!$B$13-$Q15)<0,0,MIN(('Max. ARC Revenue Calc'!$B$13-$Q15),R15+'Max. ARC Revenue Calc'!$B$17,'Max. ARC Revenue Calc'!$B$15))","v":0.5},0,{"$f":"MIN(S15+'Max. ARC Revenue Calc'!$B$17,'Max. ARC Revenue Calc'!$B$15)","v":0.5},0,{"$f":"IF(('Max. ARC Revenue Calc'!$B$14 - V15)<0,0,MIN(('Max. ARC Revenue Calc'!$B$14 - V15),W15 + 'Max. ARC Revenue Calc'!$B$18, 'Max. ARC Revenue Calc'!$B$16))","v":1},0]
["S3: Example 3","S3","S3StudyArea","Example 3",0,0,0,0,0,0,0,0,0,0,0,0,0,0,0,null,0,0,0,null,{"$f":"IF(('Max. ARC Revenue Calc'!$B$13-$Q16)<0,0,MIN(('Max. ARC Revenue Calc'!$B$13-$Q16),R16+'Max. ARC Revenue Calc'!$B$17,'Max. ARC Revenue Calc'!$B$15))","v":0.5},0,{"$f":"MIN(S16+'Max. ARC Revenue Calc'!$B$17,'Max. ARC Revenue Calc'!$B$15)","v":0.5},0,{"$f":"IF(('Max. ARC Revenue Calc'!$B$14 - V16)<0,0,MIN(('Max. ARC Revenue Calc'!$B$14 - V16),W16 + 'Max. ARC Revenue Calc'!$B$18, 'Max. ARC Revenue Calc'!$B$16))","v":1},0]
[null,null,null,null,null,null,null,null,null,null,null,null,null,null,null,null,null,null,null,null,""]
[null,null,null,"Label 2",null,null,null,null,null,null,null,null,null,null,null,null,null,null,null,null,""]
["S3: Example 4","S3","S3StudyArea","Example 4",0,0,0,0,0,0,0,0,0,0,0,0,0,0,0,null,0,0,0,null,{"$f":"IF(('Max. ARC Revenue Calc'!$B$13-$Q19)<0,0,MIN(('Max. ARC Revenue Calc'!$B$13-$Q19),R19+'Max. ARC Revenue Calc'!$B$17,'Max. ARC Revenue Calc'!$B$15))","v":0.5},0,{"$f":"MIN(S19+'Max. ARC Revenue Calc'!$B$17,'Max. ARC Revenue Calc'!$B$15)","v":0.5},0,{"$f":"IF(('Max. ARC Revenue Calc'!$B$14 - V19)<0,0,MIN(('Max. ARC Revenue Calc'!$B$14 - V19),W19 + 'Max. ARC Revenue Calc'!$B$18, 'Max. ARC Revenue Calc'!$B$16))","v":1},0]
["S3: Example 5","S3","S3StudyArea","Example 5",0,0,0,0,0,0,0,0,0,0,0,0,0,0,0,null,0,0,0,null,{"$f":"IF(('Max. ARC Revenue Calc'!$B$13-$Q20)<0,0,MIN(('Max. ARC Revenue Calc'!$B$13-$Q20),R20+'Max. ARC Revenue Calc'!$B$17,'Max. ARC Revenue Calc'!$B$15))","v":0.5},0,{"$f":"MIN(S20+'Max. ARC Revenue Calc'!$B$17,'Max. ARC Revenue Calc'!$B$15)","v":0.5},0,{"$f":"IF(('Max. ARC Revenue Calc'!$B$14 - V20)<0,0,MIN(('Max. ARC Revenue Calc'!$B$14 - V20),W20 + 'Max. ARC Revenue Calc'!$B$18, 'Max. ARC Revenue Calc'!$B$16))","v":1},0]
{"$rows_left_out":232}
{"sheet":"State4","index":3,"n_rows":15,"n_cols":30,"rows_kept":15,"cut":false,"hidden":false,"merged":[[5,4,5,14],[5,24,6,25],[5,26,6,27],[5,28,6,29],[6,4,6,13],[6,20,6,21]]}
[null,3257,"Filing Date:","2022-06-16",null,null,null,null,null,null,null,null,null,null,null,null,"ARC-CAF-1"]
[null,null,"Holding Company:"]
[null,null,"Filing Name:"]
[]
[]
[null,null,null,null,"Rate Ceiling Component Charges Calculation ( 51.915(b)(11) )",null,null,null,null,null,null,null,null,null,null,null,null,null,null,null,null,null,null,null,"RESIDENCE / NP  (excluding Lifeline)",null,"SLB / BRI",null,"MULTI-LINE BUSINESS"]
[null,null,"Study Area","EXCHANGES","RESIDENCE / NP / BRI / SLB (excluding Lifeline)",null,null,null,null,null,null,null,null,null,"Total Crnt Yr","Max Total","Maximum",null,null,null,"MULTI-LINE BUSINESS"]
[null,null,null,null,"Res / NP","SLB / BRI",null,null,"Mandatory",null,null,null,null,null,"Rate Ceiling","Rate Ceiling","Rate Ceiling","Res / NP","SLB / BRI",null,null,null,null,null,"MAX Curr Yr",null,"MAX Curr Yr",null,"MAX Curr Yr"]
[null,null,null,null,"Tariff Period  ","Tariff Period  ","Stand-alone","Mandatory","Zone","State",null,null,"State ","Federal","Comp. Chgs","Comp. Chgs","Comp. Chgs","Prv Yrs","Prv Yrs",null,"Tariff Period  ","Federal","Prv Yrs",null,"Res / NP","MAX Curr Yr","SLB / BRI","MAX Curr Yr","MLB","MAX Curr Yr"]
[null,null,null,null,"Projected Lines","Projected Lines","R1 rate","EAS","Charges","SLC","E911","TRS","USF","SLC","w/o ARC","Since 2012","to date","Max Rate","Max Rate",null,"Projected Lines","SLC-MLB","Max Rate",null,"ARC Rate","ARC Rev","ARC Rate","ARC Rev","ARC Rate","ARC Rev"]
[]
[null,null,null,"State4"]
[{"$f":"B13&\": \"&D13","v":"S4: Exchange 1"},"S4","S4StudyArea","Exchange 1",0,0,0,0,0,0,0,0,0,0,{"$f":"ROUND(SUM(G13:N13),2)","v":0},0,{"$f":"MAX(O13,P13)","v":0},0,0,null,0,0,0,null,{"$f":"IF(('Max. ARC Revenue Calc'!$B$13-$Q13)<0,0,MIN(('Max. ARC Revenue Calc'!$B$13-$Q13),R13+'Max. ARC Revenue Calc'!$B$17,'Max. ARC Revenue Calc'!$B$15))","v":0.5},{"$f":"E13*Y13","v":0},{"$f":"MIN(S13+'Max. ARC Revenue Calc'!$B$17,'Max. ARC Revenue Calc'!$B$15)","v":0.5},{"$f":"F13*AA13","v":0},{"$f":"IF(('Max. ARC Revenue Calc'!$B$14 - V13)<0,0,MIN(('Max. ARC Revenue Calc'!$B$14 - V13),W13 + 'Max. ARC Revenue Calc'!$B$18, 'Max. ARC Revenue Calc'!$B$16))","v":1},{"$f":"U13*AC13","v":0}]
[{"$f":"B14&\": \"&D14","v":"S4: Exchange 2"},"S4","S4StudyArea","Exchange 2",0,0,0,0,0,0,0,0,0,0,{"$f":"ROUND(SUM(G14:N14),2)","v":0},0,{"$f":"MAX(O14,P14)","v":0},0,0,null,0,0,0,null,{"$f":"IF(('Max. ARC Revenue Calc'!$B$13-$Q14)<0,0,MIN(('Max. ARC Revenue Calc'!$B$13-$Q14),R14+'Max. ARC Revenue Calc'!$B$17,'Max. ARC Revenue Calc'!$B$15))","v":0.5},{"$f":"E14*Y14","v":0},{"$f":"MIN(S14+'Max. ARC Revenue Calc'!$B$17,'Max. ARC Revenue Calc'!$B$15)","v":0.5},{"$f":"F14*AA14","v":0},{"$f":"IF(('Max. ARC Revenue Calc'!$B$14 - V14)<0,0,MIN(('Max. ARC Revenue Calc'!$B$14 - V14),W14 + 'Max. ARC Revenue Calc'!$B$18, 'Max. ARC Revenue Calc'!$B$16))","v":1},{"$f":"U14*AC14","v":0}]
[{"$f":"B15&\": \"&D15","v":"S4: Exchange 3"},"S4","S4StudyArea","Exchange 3",0,0,0,0,0,0,0,0,0,0,{"$f":"ROUND(SUM(G15:N15),2)","v":0},0,{"$f":"MAX(O15,P15)","v":0},0,0,null,0,0,0,null,{"$f":"IF(('Max. ARC Revenue Calc'!$B$13-$Q15)<0,0,MIN(('Max. ARC Revenue Calc'!$B$13-$Q15),R15+'Max. ARC Revenue Calc'!$B$17,'Max. ARC Revenue Calc'!$B$15))","v":0.5},{"$f":"E15*Y15","v":0},{"$f":"MIN(S15+'Max. ARC Revenue Calc'!$B$17,'Max. ARC Revenue Calc'!$B$15)","v":0.5},{"$f":"F15*AA15","v":0},{"$f":"IF(('Max. ARC Revenue Calc'!$B$14 - V15)<0,0,MIN(('Max. ARC Revenue Calc'!$B$14 - V15),W15 + 'Max. ARC Revenue Calc'!$B$18, 'Max. ARC Revenue Calc'!$B$16))","v":1},{"$f":"U15*AC15","v":0}]

{"sheet":"Max. ARC Revenue Calc","index":4,"n_rows":27,"n_cols":13,"rows_kept":27,"cut":false,"hidden":false,"merged":[[19,0,20,0],[19,1,20,1],[19,5,19,7],[19,11,19,12],[19,2,19,4],[19,8,19,10]]}
["Filing Date:","2022-06-16",null,null,null,null,null,null,null,null,null,"ARC-CAF-2"]
["Holding Company:"]
["Filing Name:"]
[]
[]
["Eligible Revenue - Current Yr Recovery",0]
["Recovery Allocated to Res/SLB: ( 51.915(e)(4))",0]
["Recovery Allocated to MLB: ( 51.915(e)(4))",{"$f":"B6-B7","v":0}]
[]
["Maximum ARC opportunity Revenue",{"$f":"VLOOKUP(\"Total\",A:M,13,FALSE)","v":0}]
["Carriers may no longer recover CAF (51.915(f)(6))",{"$f":"'CAF Calc'!J10","v":0}]
[]
["Residential Rate Ceiling: ( 51.915(b)(12) )",30]
["Maximum MLB SLC+ARC ( 51.915(e)(5)(iv) )",12.2]
["Max ARC for current year:  Res/SLB",2.5]
["Max ARC for current year:  MLB",5]
["Max ARC increase per year:  Res/SLB",0.5]
["Max ARC increase per year:  MLB",1]
[]
["Study Area Names","Study Area","Primary / Non Primary Residential",null,null,"SLB / BRI",null,null,"MLB",null,null,"Total Eligible Lines"]
{"$rows_left_out":8}
{"sheet":"CAF Calc","index":5,"n_rows":22,"n_cols":15,"rows_kept":22,"cut":false,"hidden":false,"merged":[[14,13,15,13],[14,14,15,14],[14,1,15,1],[14,2,14,3],[14,8,15,8],[14,9,15,9],[14,12,15,12],[14,4,14,5],[14,11,15,11],[14,10,15,10],[4,9,8,9],[4,7,8,7],[14,0,15,0],[4,8,8,8],[9,7,10,7],[9,8,10,8],[9,9,10,9],[14,6,14,7]]}
["Filing Date:","2022-06-16",null,null,null,null,null,null,null,null,null,null,null,"ARC-CAF-3"]
["Holding Company:"]
["Filing Name:"]
[]
[null,null,null,null,null,null,null,"Holding Company Eligible Recovery","Holding Company Maximum ARC Revenues","Carriers may no longer recover any amount from CAF ICC Support (51.915(f)(6))"]
["Residential Rate Ceiling: ( 51.915(b)(12) )",{"$f":"'Max. ARC Revenue Calc'!B13","v":30}]
["Maximum MLB SLC+ARC ( 51.915(e)(5)(iv) )",{"$f":"'Max. ARC Revenue Calc'!B14","v":12.2}]
["Max ARC for current year:  Res/SLB",{"$f":"'Max. ARC Revenue Calc'!B15","v":2.5}]
["Max ARC for current year:  MLB",{"$f":"'Max. ARC Revenue Calc'!B16","v":5}]
["Max ARC increase per year:  Res/SLB",{"$f":"'Max. ARC Revenue Calc'!B17","v":0.5},null,null,null,null,null,{"$f":"'Max. ARC Revenue Calc'!B6","v":0},{"$f":"'Max. ARC Revenue Calc'!B10","v":0},{"$f":"0","v":0}]
["Max ARC increase per year:  MLB",{"$f":"'Max. ARC Revenue Calc'!B18","v":1}]
[]
[]
[]
["Study Area Names","Study Areas","Primary / Non Primary Residential",null,"SLB / BRI",null,"MLB",null,"Total ARC Eligible Projected Line Demand","Maximum Residential ARC Revenue Opportunity (from eligible lines)","Maximum SLB / BRI ARC Revenue Opportunity","Maximum MLB ARC Revenue Opportunity","Total Maximum ARC Revenue Opportunity ","Eligible Recovery","Maximum ARC Revenue Shortfall"]
[null,null,"All Tariff Period Projected Lines","ARC Eligible Tariff Period Projected Lines","All Tariff Period Projected Lines","ARC Eligible Tariff Period Projected Lines","All Tariff Period Projected Lines","ARC Eligible Tariff Period  Projected Lines"]
["State 1 Study Area","S1StudyArea",{"$f":"SUMIF('State1&State2'!C:C,B17,'State1&State2'!E:E)","v":0},{"$f":"SUMIFS('State1&State2'!E:E,'State1&State2'!Q:Q,\"<\"&B$6,'State1&State2'!C:C,\"=\"&B17)","v":0},{"$f":"SUMIF('State1&State2'!C:C,B17,'State1&State2'!F:F)","v":0},{"$f":"SUMIF('State1&State2'!C:C,B17,'State1&State2'!F:F)","v":0},{"$f":"SUMIF('State1&State2'!C:C,B17,'State1&State2'!U:U)","v":0},{"$f":"SUMIFS('State1&State2'!U:U,'State1&State2'!V:V,\"<\"&B$7,'State1&State2'!C:C,\"=\"&B17)","v":0},{"$f":"D17+F17+H17","v":0},{"$f":"VLOOKUP(B17,'Max. ARC Revenue Calc'!B:E,4,FALSE)","v":0},{"$f":"VLOOKUP(B17,'Max. ARC Revenue Calc'!B:H,7,FALSE)","v":0},{"$f":"VLOOKUP(B17,'Max. ARC Revenue Calc'!B:K,10,FALSE)","v":0},{"$f":"J17+K17+L17","v":0},0,{"$f":"IF(M17>N17,0,N17-M17)","v":0}]
["State 2 Study Area","S2StudyArea",{"$f":"SUMIF('State1&State2'!C:C,B18,'State1&State2'!E:E)","v":0},{"$f":"SUMIFS('State1&State2'!E:E,'State1&State2'!Q:Q,\"<\"&B$6,'State1&State2'!C:C,\"=\"&B18)","v":0},{"$f":"SUMIF('State1&State2'!C:C,B18,'State1&State2'!F:F)","v":0},{"$f":"SUMIF('State1&State2'!C:C,B18,'State1&State2'!F:F)","v":0},{"$f":"SUMIF('State1&State2'!C:C,B18,'State1&State2'!U:U)","v":0},{"$f":"SUMIFS('State1&State2'!U:U,'State1&State2'!V:V,\"<\"&B$7,'State1&State2'!C:C,\"=\"&B18)","v":0},{"$f":"D18+F18+H18","v":0},{"$f":"VLOOKUP(B18,'Max. ARC Revenue Calc'!B:E,4,FALSE)","v":0},{"$f":"VLOOKUP(B18,'Max. ARC Revenue Calc'!B:H,7,FALSE)","v":0},{"$f":"VLOOKUP(B18,'Max. ARC Revenue Calc'!B:K,10,FALSE)","v":0},{"$f":"J18+K18+L18","v":0},0,{"$f":"IF(M18>N18,0,N18-M18)","v":0}]
["State 3 Study Area","S3StudyArea",{"$f":"SUMIF(State3!C:C,B19,State3!E:E)","v":0},{"$f":"SUMIFS(State3!E:E,State3!Q:Q,\"<\"&B$6,State3!C:C,\"=\"&B19)","v":0},{"$f":"SUMIF(State3!C:C,B19,State3!F:F)","v":0},{"$f":"SUMIF(State3!C:C,B19,State3!F:F)","v":0},{"$f":"SUMIF(State3!C:C,B19,State3!U:U)","v":0},{"$f":"SUMIFS(State3!U:U,State3!V:V,\"<\"&B$7,State3!C:C,\"=\"&B19)","v":0},{"$f":"D19+F19+H19","v":0},{"$f":"VLOOKUP(B19,'Max. ARC Revenue Calc'!B:E,4,FALSE)","v":0},{"$f":"VLOOKUP(B19,'Max. ARC Revenue Calc'!B:H,7,FALSE)","v":0},{"$f":"VLOOKUP(B19,'Max. ARC Revenue Calc'!B:K,10,FALSE)","v":0},{"$f":"J19+K19+L19","v":0},0,{"$f":"IF(M19>N19,0,N19-M19)","v":0}]
["State 4 Study Area","S4StudyArea",{"$f":"SUMIF(State4!C:C,B20,State4!E:E)","v":0},{"$f":"SUMIFS(State4!E:E,State4!Q:Q,\"<\"&B$6,State4!C:C,\"=\"&B20)","v":0},{"$f":"SUMIF(State4!C:C,B20,State4!F:F)","v":0},{"$f":"SUMIF(State4!C:C,B20,State4!F:F)","v":0},{"$f":"SUMIF(State4!C:C,B20,State4!U:U)","v":0},{"$f":"SUMIFS(State4!U:U,State4!V:V,\"<\"&B$7,State4!C:C,\"=\"&B20)","v":0},{"$f":"D20+F20+H20","v":0},{"$f":"VLOOKUP(B20,'Max. ARC Revenue Calc'!B:E,4,FALSE)","v":0},{"$f":"VLOOKUP(B20,'Max. ARC Revenue Calc'!B:H,7,FALSE)","v":0},{"$f":"VLOOKUP(B20,'Max. ARC Revenue Calc'!B:K,10,FALSE)","v":0},{"$f":"J20+K20+L20","v":0},0,{"$f":"IF(M20>N20,0,N20-M20)","v":0}]
{"$rows_left_out":3}
{"sheet":"Footnotes","index":6,"n_rows":5,"n_cols":10,"rows_kept":5,"cut":false,"hidden":false,"merged":[[4,0,4,9]]}
["Filing Date:",null,"2022-06-16",null,null,null,null,null,null,"ARC-CAF-4"]
["Holding Company:"]
["Filing Name:"]
[]
["FOOTNOTES:"]

{"sheet":"End","index":7,"n_rows":0,"n_cols":0,"rows_kept":0,"cut":false,"hidden":false,"merged":[]}