{"text_format":"1","workbook":"xlsx","n_sheets":8,"sheets":["Menu","State1&State2","Max. ARC Revenue Calc","State3","State4","ExchangeLevel ARC","CAF Calc","Footnotes"],"not_rendered":{"charts":0,"images":0,"macros":1,"external_links":0,"defined_names":29,"comments":0,"pivot_tables":0},"unopened":[],"bounds":{"document_bytes":16777216,"sheet_cells":100000,"rows_first":2000,"rows_last":500,"rows_between":2000,"halvings":0,"cell_chars":16384,"cell_head_chars":4096},"cells_cut":0,"cells_raw":0,"read":"whole","date_system":"1900"}

{"sheet":"Menu","index":0,"n_rows":4,"n_cols":6,"rows_kept":4,"cut":false,"hidden":false,"merged":[[9,5,10,5],[33,5,34,5],[17,5,18,5]]}
[]
[null,null,null,null,null,"KEY (Erase text & color before filing):"]
[null,null,null,null,null,"Label / Date Change"]
[null,null,null,null,null,"Formula changes / mandated by FCC rules"]

{"sheet":"State1&State2","index":1,"n_rows":28,"n_cols":24,"rows_kept":28,"cut":false,"hidden":false,"merged":[[5,4,5,14],[5,25,6,26],[5,27,6,28],[5,29,6,30],[6,4,6,13],[6,19,6,21]]}
[null,27,"Filing Date:","2022-06-16"]
[null,null,"Holding Company:"]
[null,null,"Filing Name:"]
[]
[]
[null,null,null,null,"Rate Ceiling Component Charges Calculation ( 51.915(b)(11) )"]
[null,null,"Study Area","EXCHANGES","RESIDENCE / NP / BRI / SLB (excluding Lifeline)",null,null,null,null,null,null,null,null,null,"Total Crnt Yr","Max Total","Res / NP","SLB / BRI",null,"MULTI-LINE BUSINESS",null,null,"nonCentrex","Centrex"]
[null,null,null,null,"Res / NP","SLB / BRI",null,null,"Mandatory",null,null,null,null,null,"Rate Ceiling","Rate Ceiling","Previous","Previous",null,"nonCentrex","Centrex",null,"Previous","Previous"]
[null,null,null,null,"Tariff Period  ","Tariff Period  ","Stand-alone","Mandatory","Zone","State",null,null,"State ","Federal","Comp. Chgs","Comp. Chgs","Yr Tariffed","Yr Tariffed",null,"Tariff Period  ","Tariff Period  ","Federal","Yr Tariffed","Yr Tariffed"]
[null,null,null,null,"Projected Lines","Projected Lines","R1 rate","EAS","Charges","SLC","E911","TRS","USF","SLC","w/o ARC","Since 2012","Arc Rate","Arc Rate",null,"Projected Lines","Projected Lines","SLC-MLB","Arc Rate","Arc Rate"]
[null,null,null,"State1"]
[{"$f":"B12&\": \"&D12","v":"State1: Example 1"},"State1","S1StudyArea","Example 1",null,null,null,null,null,null,null,null,null,null,{"$f":"ROUND(SUM(G12:N12),2)","v":0}]
["State1: Example 2","State1","S1StudyArea","Example 2",null,null,null,null,null,null,null,null,null,null,0]
["State1: Example 3","State1","S1StudyArea","Example 3",null,null,null,null,null,null,null,null,null,null,0]
["State1: Example 4","State1","S1StudyArea","Example 4",null,null,null,null,null,null,null,null,null,null,0]
["State1: Example 5","State1","S1StudyArea","Example 5",null,null,null,null,null,null,null,null,null,null,0]
["State1: Example 6","State1","S1StudyArea","Example 6",null,null,null,null,null,null,null,null,null,null,0]
["State1: Example 7","State1","S1StudyArea","Example 7",null,null,null,null,null,null,null,null,null,null,0]
["State1: Example 8","State1","S1StudyArea","Example 8",null,null,null,null,null,null,null,null,null,null,0]
["State1: Example 9","State1","S1StudyArea","Example 9",null,null,null,null,null,null,null,null,null,null,0]
["State1: Example 10","State1","S1StudyArea","Example 10",null,null,null,null,null,null,null,null,null,null,0]
["State1: Example 11","State1","S1StudyArea","Example 11",null,null,null,null,null,null,null,null,null,null,0]
["State1: Example 12","State1","S1StudyArea","Example 12",null,null,null,null,null,null,null,null,null,null,0]
[]
[null,null,null,"State2"]
[{"$f":"B26&\": \"&D26","v":"State2: Example 1"},"State2","S2StudyArea","Example 1",null,null,null,null,null,null,null,null,null,null,{"$f":"ROUND(SUM(G26:N26),2)","v":0}]
[{"$f":"B27&\": \"&D27","v":"State2: Example 2"},"State2","S2StudyArea","Example 2",null,null,null,null,null,null,null,null,null,null,{"$f":"ROUND(SUM(G27:N27),2)","v":0}]
[null,"End"]

{"sheet":"Max. ARC Revenue Calc","index":2,"n_rows":24,"n_cols":13,"rows_kept":24,"cut":false,"hidden":true,"merged":[[19,0,20,0],[19,1,20,1],[19,5,19,7],[19,11,19,12],[19,2,19,4],[19,8,19,10]]}
["Filing Date:","2014-06-16"]
["Holding Company:"]
["Filing Name:"]
[]
[]
["Eligible Revenue - Current Yr Recovery",{"$f":"#REF!","v":{"$error":"#REF!"}}]
["Recovery Allocated to Res/SLB: ( 51.915(e)(4))",{"$f":"ROUND((VLOOKUP(\"Total\",A:C,3,FALSE)+VLOOKUP(\"Total\",A:F,6,FALSE))/(VLOOKUP(\"Total\",A:C,3,FALSE)+VLOOKUP(\"Total\",A:F,6,FALSE)+2*VLOOKUP(\"Total\",A:I,9,FALSE))*B6,2)","v":{"$error":"#DIV/0!"}}]
["Recovery Allocated to MLB: ( 51.915(e)(4))",{"$f":"B6-B7","v":{"$error":"#REF!"}}]
[]
["Maximum ARC opportunity Revenue",{"$f":"VLOOKUP(\"Total\",A:M,13,FALSE)","v":0}]
["Maximum CAF ICC Support",{"$f":"'CAF Calc'!J10","v":{"$error":"#REF!"}}]
[]
["Residential Rate Ceiling: ( 51.915(b)(12) )",30]
["Maximum MLB SLC+ARC ( 51.915(e)(5)(iv) )",12.2]
["Max ARC for current year:  Res/SLB",2]
["Max ARC for current year:  MLB",4]
["Max ARC increase per year:  Res/SLB",0.5]
["Max ARC increase per year:  MLB",1]
[]
["Study Area Names","Study Area","Primary/Non Primary Residential/BRI",null,null,"SLB",null,null,"MLB",null,null,"Total Eligible Lines"]
[null,null,"All Tariff Period  Projected Lines","ARC Eligible Tariff Period Projected Lines","Maximum ARC opportunity Revenue","All Tariff Period Projected Lines","ARC Eligible Tariff Period Projected Lines","Maximum ARC opportunity Revenue","All Tariff Period Projected Lines","ARC EligibleTariff Period Projected Lines","Maximum ARC opportunity Revenue","Tariff Period Projected Eligible Line Demand","Maximum ARC opportunity Revenue"]
[]
[]
["Total",null,{"$f":"SUM(C22:C23)","v":0},0,0,0,0,0,0,0,0,0,0]

{"sheet":"State3","index":3,"n_rows":251,"n_cols":24,"rows_kept":251,"cut":false,"hidden":false,"merged":[[5,4,5,14],[5,25,6,26],[5,27,6,28],[5,29,6,30],[6,4,6,13],[6,19,6,21]]}
[null,250,"Filing Date:","2022-06-16"]
[null,null,"Holding Company:"]
[null,null,"Filing Name:"]
[]
[]
[null,null,null,null,"Rate Ceiling Component Charges Calculation ( 51.915(b)(11) )"]
[null,null,"Study Area","EXCHANGES","RESIDENCE / NP / BRI / SLB (excluding Lifeline)",null,null,null,null,null,null,null,null,null,"Total Crnt Yr","Max Total","Res / NP","SLB / BRI",null,"MULTI-LINE BUSINESS",null,null,"nonCentrex","Centrex"]
[null,null,null,null,"Res / NP","SLB / BRI",null,null,"Mandatory",null,null,null,null,null,"Rate Ceiling","Rate Ceiling","Previous","Previous",null,"nonCentrex","Centrex",null,"Previous","Previous"]
[null,null,null,null,"Tariff Period  ","Tariff Period  ","Stand-alone","Mandatory","Zone","State",null,null,"State ","Federal","Comp. Chgs","Comp. Chgs","Yr Tariffed","Yr Tariffed",null,"Tariff Period  ","Tariff Period  ","Federal","Yr Tariffed","Yr Tariffed"]
[null,null,null,null,"Projected Lines","Projected Lines","R1 rate","EAS","Charges","SLC","E911","TRS","USF","SLC","w/o ARC","Since 2012","Arc Rate","Arc Rate",null,"Projected Lines","Projected Lines","SLC-MLB","Arc Rate","Arc Rate"]
[null,null,null,"State3"]
[null,null,null,"Label 1"]
[{"$f":"B13&\": \"&D13","v":"State3: Example 1"},"State3","S3StudyArea","Example 1",null,null,null,null,null,null,null,null,null,null,{"$f":"ROUND(SUM(G13:N13),2)","v":0}]
[{"$f":"B14&\": \"&D14","v":"State3: Example 2"},"State3","S3StudyArea","Example 2",null,null,null,null,null,null,null,null,null,null,{"$f":"ROUND(SUM(G14:N14),2)","v":0}]
[{"$f":"B15&\": \"&D15","v":"State3: Example 3"},"State3","S3StudyArea","Example 3",null,null,null,null,null,null,null,null,null,null,{"$f":"ROUND(SUM(G15:N15),2)","v":0}]
[]
[null,null,null,"Label 2"]
[{"$f":"B18&\": \"&D18","v":"State3: Example 4"},"State3","S3StudyArea","Example 4",null,null,null,null,null,null,null,null,null,null,{"$f":"ROUND(SUM(G18:N18),2)","v":0}]
[{"$f":"B19&\": \"&D19","v":"State3: Example 5"},"State3","S3StudyArea","Example 5",null,null,null,null,null,null,null,null,null,null,{"$f":"ROUND(SUM(G19:N19),2)","v":0}]
[{"$f":"B20&\": \"&D20","v":"State3: Example 6"},"State3","S3StudyArea","Example 6",null,null,null,null,null,null,null,null,null,null,{"$f":"ROUND(SUM(G20:N20),2)","v":0}]
[{"$f":"B21&\": \"&D21","v":"State3: Example 7"},"State3","S3StudyArea","Example 7",null,null,null,null,null,null,null,null,null,null,{"$f":"ROUND(SUM(G21:N21),2)","v":0}]
[{"$f":"B22&\": \"&D22","v":"State3: Example 8"},"State3","S3StudyArea","Example 8",null,null,null,null,null,null,null,null,null,null,{"$f":"ROUND(SUM(G22:N22),2)","v":0}]
[]
[null,null,null,"Label 3"]
[{"$f":"B25&\": \"&D25","v":"State3: Example 9"},"State3","S3StudyArea","Example 9",null,null,null,null,null,null,null,null,null,null,{"$f":"ROUND(SUM(G25:N25),2)","v":0}]
[]
[null,null,null,"Label 4"]
[{"$f":"B28&\": \"&D28","v":"State3: Example 10"},"State3","S3StudyArea","Example 10",null,null,null,null,null,null,null,null,null,null,{"$f":"ROUND(SUM(G28:N28),2)","v":0}]
["State3: Example 11","State3","S3StudyArea","Example 11",null,null,null,null,null,null,null,null,null,null,0]
["State3: Example 12","State3","S3StudyArea","Example 12",null,null,null,null,null,null,null,null,null,null,0]
{"$rows_left_out":222}
{"sheet":"State4","index":4,"n_rows":15,"n_cols":24,"rows_kept":15,"cut":false,"hidden":false,"merged":[[5,4,5,14],[5,25,6,26],[5,27,6,28],[5,29,6,30],[6,4,6,13],[6,19,6,21]]}
[null,14,"Filing Date:","2022-06-16"]
[null,null,"Holding Company:"]
[null,null,"Filing Name:"]
[]
[]
[null,null,null,null,"Rate Ceiling Component Charges Calculation ( 51.915(b)(11) )"]
[null,null,"Study Area","EXCHANGES","RESIDENCE / NP / BRI / SLB (excluding Lifeline)",null,null,null,null,null,null,null,null,null,"Total Crnt Yr","Max Total","Res / NP","SLB / BRI",null,"MULTI-LINE BUSINESS",null,null,"nonCentrex","Centrex"]
[null,null,null,null,"Res / NP","SLB / BRI",null,null,"Mandatory",null,null,null,null,null,"Rate Ceiling","Rate Ceiling","Previous","Previous",null,"nonCentrex","Centrex",null,"Previous","Previous"]
[null,null,null,null,"Tariff Period  ","Tariff Period  ","Stand-alone","Mandatory","Zone","State",null,null,"State ","Federal","Comp. Chgs","Comp. Chgs","Yr Tariffed","Yr Tariffed",null,"Tariff Period  ","Tariff Period  ","Federal","Yr Tariffed","Yr Tariffed"]
[null,null,null,null,"Projected Lines","Projected Lines","R1 rate","EAS","Charges","SLC","E911","TRS","USF","SLC","w/o ARC","Since 2012","Arc Rate","Arc Rate",null,"Projected Lines","Projected Lines","SLC-MLB","Arc Rate","Arc Rate"]
[null,null,null,"State4"]
[{"$f":"B12&\": \"&D12","v":"State4: Exchange 1"},"State4","S4StudyArea","Exchange 1",null,null,null,null,null,null,null,null,null,null,{"$f":"ROUND(SUM(G12:N12),2)","v":0}]
[{"$f":"B13&\": \"&D13","v":"State4: Exchange 2"},"State4","S4StudyArea","Exchange 2",null,null,null,null,null,null,null,null,null,null,{"$f":"ROUND(SUM(G13:N13),2)","v":0}]
[{"$f":"B14&\": \"&D14","v":"State4: Exchange 3"},"State4","S4StudyArea","Exchange 3",null,null,null,null,null,null,null,null,null,null,{"$f":"ROUND(SUM(G14:N14),2)","v":0}]
[null,"End"]

{"sheet":"ExchangeLevel ARC","index":5,"n_rows":260,"n_cols":28,"rows_kept":260,"cut":false,"hidden":false,"merged":[[22,2,22,13],[22,15,22,27],[23,6,23,7],[23,9,23,10]]}
["Filing Date:",null,"2022-06-16"]
["Holding Company:"]
["Filing Name:"]
[]
[null,null,null,null,null,null,null,null,null,"Res/SLB","MLB","Total"]
["Eligible Revenue - Current Yr Recovery",null,null,0,null,null,null,null,null,"ARC Rev","ARC Rev","ARC Rev"]
[null,null,null,null,null,null,{"$f":"A6","v":"Eligible Revenue - Current Yr Recovery"},null,null,{"$f":"D11","v":0},{"$f":"D12","v":0},{"$f":"D6","v":0}]
[null,null,null,null,null,null,"Tariffed ARC Revenue",null,null,{"$f":"N21","v":0},{"$f":"AB21","v":0},{"$f":"J8+K8","v":0}]
[]
[]
["Recovery Allocated to Res/SLB",null,null,0]
["Recovery Allocated to MLB",null,null,0]
["Residential Rate Ceiling: ( 51.915(b)(12) )",null,null,30]
["Maximum MLB SLC+ARC ( 51.915(e)(5)(iv) )",null,null,12.2]
["Max ARC for current year:  Res/SLB",null,null,2.5]
["Max ARC for current year:  MLB",null,null,5]
["Max ARC increase per year:  Res/SLB",null,null,0.5]
["Max ARC increase per year:  MLB",null,null,1]
[]
[]
["Totals",null,{"$f":"SUM(C23:C263)/2","v":0},{"$f":"SUM(D23:D263)/2","v":0},null,null,null,null,null,null,null,null,null,{"$f":"SUM(N23:N263)/2","v":0},null,{"$f":"SUM(P23:P263)/2","v":0},{"$f":"SUM(Q23:Q263)/2","v":0},null,null,null,null,null,null,null,null,null,null,{"$f":"SUM(AB23:AB263)/2","v":0}]
[]
["State","Exchange/RG","RESIDENCE / NP / BRI / SLB (excluding Lifeline)",null,null,null,null,null,null,null,null,null,null,null,null,"MULTI-LINE BUSINESS"]
[null,null,"Res / NP","SLB / BRI","Maximum","RES / NP","RES / NP Current Year",null,"SLB / BRI","SLB / BRI Current Year",null,"Total","Total RES / NP","ARC Revenue",null,"NonCentrex ","Centrex ","MLB","NonCentrex","NonCentrex","NonCentrex","Centrex","Centrex","Centrex","Total","Total","MLB","ARC Revenue"]
[null,null,"Tariff Period  ","Tariff Period  ","Total Rate ","Previous Yr","Maximum ","Tariffed ","Previous Yr","Maximum ","Tariffed","RES / NP","below Res Rate","at Tariffed",null,"Tariff Period","Tariff Period","Federal","Previous Yr","Crnt Yr Max","Tariffed","Previous Yr","Crnt Yr Max","Tariffed","NonCentrex","Centrex ","Rates below MLB","at Tariffed"]
[null,null,"Projected Lines","Projected Lines","Chgs w/o ARC","Arc Rate","ARC Rate","ARC Rate","Arc Rate","ARC Rate","ARC Rate","Rate","Ceiling ($30)","Rate",null,"Projected Lines","Projected Lines","SLC","Arc Rate","ARC Rate","ARC Rate","Arc Rate","ARC Rate","ARC Rate"," Rate","Rate","Rate Ceiling ($12.2)","Rate"]
["State1"]
[null,"State1: Example 1",{"$f":"VLOOKUP($B28,'State1&State2'!$A$10:E$27,5,FALSE)","v":0},{"$f":"VLOOKUP($B28,'State1&State2'!$A$10:F$27,6,FALSE)","v":0},{"$f":"MAX(VLOOKUP($B28,'State1&State2'!$A$10:O$27,15,FALSE),VLOOKUP($B28,'State1&State2'!$A$10:P$27,16,FALSE))","v":0},{"$f":"VLOOKUP($B28,'State1&State2'!$A$10:Q$27,17,FALSE)","v":0},{"$f":"IF(($D$13-$E28)<0,0,MIN($D$13-$E28,F28+$D$17,$D$15))","v":0.5},0,{"$f":"VLOOKUP($B28,'State1&State2'!$A$10:R$27,18,FALSE)","v":0},{"$f":"MIN(I28+$D$17,$D$15)","v":0.5},0,{"$f":"IF(C28>0,E28+H28,0)","v":0},{"$f":"IF(C28>0,IF(L28<=$D$13,\"YES\",\"NO\"),\"\")","v":""},{"$f":"C28*H28+D28*K28","v":0},null,{"$f":"VLOOKUP($B28,'State1&State2'!$A$10:T$27,20,FALSE)","v":0},{"$f":"VLOOKUP($B28,'State1&State2'!$A$10:U$24,21,FALSE)","v":0},{"$f":"VLOOKUP($B28,'State1&State2'!$A$10:V$27,22,FALSE)","v":0},{"$f":"VLOOKUP($B28,'State1&State2'!$A$10:W$27,23,FALSE)","v":0},{"$f":"MIN($D$14-$R28,S28+$D$18,$D$16)","v":1},0,{"$f":"VLOOKUP($B28,'State1&State2'!$A$10:X$27,24,FALSE)","v":0},{"$f":"MIN($D$14-$R28,V28+$D$18,$D$16)","v":1},0,{"$f":"IF(P28>0,R28+U28,0)","v":0},{"$f":"IF(Q28>0,R28+X28,0)","v":0},{"$f":"IF(OR(U28>0,X28>0),IF(AND(Y28<=$D$14,Z28<=$D$14),\"YES\",\"NO\"),\"\")","v":""},{"$f":"P28*U28+Q28*X28","v":0}]
[null,"State1: Example 2",{"$f":"VLOOKUP($B29,'State1&State2'!$A$10:E$27,5,FALSE)","v":0},{"$f":"VLOOKUP($B29,'State1&State2'!$A$10:F$27,6,FALSE)","v":0},{"$f":"MAX(VLOOKUP($B29,'State1&State2'!$A$10:O$27,15,FALSE),VLOOKUP($B29,'State1&State2'!$A$10:P$27,16,FALSE))","v":0},{"$f":"VLOOKUP($B29,'State1&State2'!$A$10:Q$27,17,FALSE)","v":0},0.5,0,{"$f":"VLOOKUP($B29,'State1&State2'!$A$10:R$27,18,FALSE)","v":0},0.5,0,0,"",0,null,{"$f":"VLOOKUP($B29,'State1&State2'!$A$10:T$27,20,FALSE)","v":0},{"$f":"VLOOKUP($B29,'State1&State2'!$A$10:U$27,21,FALSE)","v":0},{"$f":"VLOOKUP($B29,'State1&State2'!$A$10:V$27,22,FALSE)","v":0},{"$f":"VLOOKUP($B29,'State1&State2'!$A$10:W$27,23,FALSE)","v":0},1,0,{"$f":"VLOOKUP($B29,'State1&State2'!$A$10:X$27,24,FALSE)","v":0},1,0,0,0,"",0]
[null,"State1: Example 3",{"$f":"VLOOKUP($B30,'State1&State2'!$A$10:E$27,5,FALSE)","v":0},{"$f":"VLOOKUP($B30,'State1&State2'!$A$10:F$27,6,FALSE)","v":0},{"$f":"MAX(VLOOKUP($B30,'State1&State2'!$A$10:O$27,15,FALSE),VLOOKUP($B30,'State1&State2'!$A$10:P$27,16,FALSE))","v":0},{"$f":"VLOOKUP($B30,'State1&State2'!$A$10:Q$27,17,FALSE)","v":0},0.5,0,{"$f":"VLOOKUP($B30,'State1&State2'!$A$10:R$27,18,FALSE)","v":0},0.5,0,0,"",0,null,{"$f":"VLOOKUP($B30,'State1&State2'!$A$10:T$27,20,FALSE)","v":0},{"$f":"VLOOKUP($B30,'State1&State2'!$A$10:U$27,21,FALSE)","v":0},{"$f":"VLOOKUP($B30,'State1&State2'!$A$10:V$27,22,FALSE)","v":0},{"$f":"VLOOKUP($B30,'State1&State2'!$A$10:W$27,23,FALSE)","v":0},1,0,{"$f":"VLOOKUP($B30,'State1&State2'!$A$10:X$27,24,FALSE)","v":0},1,0,0,0,"",0]
{"$rows_left_out":231}
{"sheet":"CAF Calc","index":6,"n_rows":19,"n_cols":16,"rows_kept":19,"cut":false,"hidden":true,"merged":[[4,9,8,9],[4,7,8,7],[14,6,14,8],[14,0,15,0],[4,8,8,8],[9,7,10,7],[9,8,10,8],[9,9,10,9],[14,14,15,14],[14,15,15,15],[14,1,15,1],[14,2,14,3],[14,9,15,9],[14,10,15,10],[14,13,15,13],[14,4,14,5],[14,12,15,12],[14,11,15,11]]}
["Filing Date:","2014-06-16"]
["Holding Company:"]
["Filing Name:"]
[]
[null,null,null,null,null,null,null,"Holding Company Eligible Recovery","Holding Company Maximum ARC Revenues","Maximum CAF ICC Support"]
["Residential Rate Ceiling: ( 51.915(b)(12) )",{"$f":"'Max. ARC Revenue Calc'!B13","v":30}]
["Maximum MLB SLC+ARC ( 51.915(e)(5)(iv) )",{"$f":"'Max. ARC Revenue Calc'!B14","v":12.2}]
["Max ARC for current year:  Res/SLB",{"$f":"'Max. ARC Revenue Calc'!B15","v":2}]
["Max ARC for current year:  MLB",{"$f":"'Max. ARC Revenue Calc'!B16","v":4}]
["Max ARC increase per year:  Res/SLB",{"$f":"'Max. ARC Revenue Calc'!B17","v":0.5},null,null,null,null,null,{"$f":"'Max. ARC Revenue Calc'!B6","v":{"$error":"#REF!"}},{"$f":"'Max. ARC Revenue Calc'!B10","v":0},{"$f":"IF(I10>H10,0,(H10-I10))","v":{"$error":"#REF!"}}]
["Max ARC increase per year:  MLB",{"$f":"'Max. ARC Revenue Calc'!B18","v":1}]
[]
[]
[]
["Study Area Names","Study Areas","Primary/Non Primary Residential/BRI",null,"SLB",null,"MLB",null,null,"Total ARC Eligible Projected Line Demand","Maximum Residential ARC Revenue Opportunity (from eligible lines)","Maximum SLB ARC Revenue Opportunity","Maximum MLB ARC Revenue Opportunity","Total Maximum ARC Revenue Opportunity ","Eligible Recovery","Maximum ARC Revenue Shortfall"]
[null,null,"All Tariff Period Projected Lines","ARC Eligible Tariff Period Projected Lines","All Tariff Period Projected Lines","ARC Eligible Tariff Period Projected Lines","All Tariff Period Projected Lines","ARC Eligible Tariff Period  Non-Centrex Projected Lines","ARC Eligible Tariff Period  Centrex Projected Lines"]
[]
[]
["Total",null,{"$f":"SUM(C17:C18)","v":0},0,0,0,0,0,0,0,0,0,0,0,0]

{"sheet":"Footnotes","index":7,"n_rows":5,"n_cols":3,"rows_kept":5,"cut":false,"hidden":false,"merged":[[4,0,4,9]]}
["Filing Date:",null,"2022-06-16"]
["Holding Company:"]
["Filing Name:"]
[]
["FOOTNOTES:"]